{"text_format":"1","workbook":"xlsx","n_sheets":15,"sheets":["Tool","Translations","Comments","choix-multiples","Calculs surface","Facteur solaire","Page_calcul","Coût_Net","Calcul_CoûtBrut_m²","EnergieProduite_kWc_m²","Certificats_Verts","Tableau pour le rapport","Déductions_fiscales","Messages","Révision de versions"],"not_rendered":{"charts":3,"images":9,"macros":1,"external_links":0,"defined_names":68,"comments":7,"pivot_tables":0},"unopened":[],"bounds":{"document_bytes":16777216,"sheet_cells":100000,"rows_first":2000,"rows_last":500,"rows_between":2000,"halvings":0,"cell_chars":16384,"cell_head_chars":4096},"cells_cut":0,"cells_raw":0,"read":"whole","date_system":"1900"}

{"sheet":"Tool","index":0,"n_rows":154,"n_cols":23,"rows_kept":154,"cut":false,"hidden":false,"merged":[[9,2,9,7],[12,2,12,7],[10,2,10,4],[10,5,10,7],[3,3,3,4],[4,4,4,6],[7,2,7,7],[8,2,8,7],[143,22,143,23],[55,2,56,10],[16,5,16,13],[20,3,20,5],[71,2,72,10],[20,7,20,9],[21,21,21,24],[29,6,33,12],[96,7,97,12]]}
[]
[]
[]
[null,null,null,"PV Calc",null,null,null,null,{"$f":"VLOOKUP(\"version\",Translations,LANG,FALSE) &  \": \" & \"16/01/2023\"","v":"Version: 16/01/2023"}]
[null,null,null,null,"Kies uw taal / Choisissez votre langue :",null,null,"FR"]
[null,null,{"$f":"VLOOKUP(\"title_tool\",Translations,LANG,FALSE)","v":"Calcul approximatif de la rentabilité d'une installation photovoltaïque pour la Région de Bruxelles-Capitale "}]
[]
[null,null,{"$f":"VLOOKUP(\"value_situation\",Translations,LANG,FALSE)","v":"- Encodez les données relatives à votre situation dans les cases bleues."}]
[null,null,{"$f":"VLOOKUP(\"var_price\",Translations,LANG,FALSE)","v":"- Encodez des variantes au scénario d'évolution des prix, données facultatives."}]
[null,null,{"$f":"VLOOKUP(\"resu_witt\",Translations,LANG,FALSE)","v":"- Les résultats sont repris dans les cases blanches; les formules qu'elles contiennent peuvent être modifiées."}]
{"$rows_left_out":145}
{"sheet":"Translations","index":1,"n_rows":276,"n_cols":15,"rows_kept":276,"cut":false,"hidden":true,"merged":[]}
["Copy paste","Key","NL","FR","EN","DE","Traduction utilisé dans tool",null,null,null,null,null,null,"Indice lang traduction",{"$f":"MATCH(Tool!H5,Translations!$C$1:$AA$1,0)+1","v":3}]
[null,"version","Versie","Version",null,null,{"$f":"VLOOKUP(B2,Translations,LANG,FALSE)","v":"Version"}]
[{"$f":"\"#VLOOKUP(\" & \"\"\"\" & B3 & \"\"\"\" & \";Translations;LANG;FALSE)\"","v":"#VLOOKUP(\"title_tool\";Translations;LANG;FALSE)"},"title_tool","Benaderende studie van de rendabiliteit van een fotovoltaïsche installatie in het Brussels Hoofdstedelijk Gewest","Calcul approximatif de la rentabilité d'une installation photovoltaïque pour la Région de Bruxelles-Capitale ","Approximative study",null,"Calcul approximatif de la rentabilité d'une installation photovoltaïque pour la Région de Bruxelles-Capitale "]
[{"$f":"\"#VLOOKUP(\" & \"\"\"\" & B4 & \"\"\"\" & \";Translations;LANG;FALSE)\"","v":"#VLOOKUP(\"value_situation\";Translations;LANG;FALSE)"},"value_situation","- Gelieve de waarde aangaande uw situatie toe te voegen in de blauwe cel.","- Encodez les données relatives à votre situation dans les cases bleues.",null,null,"- Encodez les données relatives à votre situation dans les cases bleues."]
["#VLOOKUP(\"var_price\";Translations;LANG;FALSE)","var_price","- Gelieve uw varianten van de prijsontwikkeling en facultatieve gegevens toe te voegen.","- Encodez des variantes au scénario d'évolution des prix, données facultatives.",null,null,"- Encodez des variantes au scénario d'évolution des prix, données facultatives."]
["#VLOOKUP(\"resu_witt\";Translations;LANG;FALSE)","resu_witt","- De resultaten worden in de witte cellen opgenomen, de onderliggende formules kunnen gewijzigd worden.","- Les résultats sont repris dans les cases blanches; les formules qu'elles contiennent peuvent être modifiées.",null,null,"- Les résultats sont repris dans les cases blanches; les formules qu'elles contiennent peuvent être modifiées."]
["#VLOOKUP(\"name_org\";Translations;LANG;FALSE)","name_org","Benaming van de instelling :","Nom de l'établissement :",null,null,"Nom de l'établissement :"]
["#VLOOKUP(\"bep_afm\";Translations;LANG;FALSE)","bep_afm","Bepaling van de afmetingen van de fotovoltaïsche installatie","Dimensionnement de l'installation photovoltaïque",null,null,"Dimensionnement de l'installation photovoltaïque"]
["#VLOOKUP(\"1st_elek\";Translations;LANG;FALSE)","1st_elek","1ste stap : Bepaling van uw elektriciteitsverbruik","Etape 1 : Déterminer votre consommation électrique",null,null,"Etape 1 : Déterminer votre consommation électrique"]
["#VLOOKUP(\"act_sec\";Translations;LANG;FALSE)","act_sec","Activiteitensector","Secteur d'activité ",null,null,"Secteur d'activité "]
{"$rows_left_out":267}
{"sheet":"Comments","index":2,"n_rows":13,"n_cols":3,"rows_kept":13,"cut":false,"hidden":true,"merged":[]}
[]
["Each cell with a comment should have a named range with as name a value in this column. "]
["Named Range","(Title)","Tekst"]
["_Cmt_ConsumAct",null,{"$f":"VLOOKUP(\"CommentTotalStrm\",Translations,LANG,FALSE)","v":"Encoder ici la consommation totale annuelle d'électricité consommée sur le site.  \n---\nPar défaut, le logiciel estime une consommation pour votre bâtiment basé sur les hypothèses suivantes:\n- Un ménage Bruxellois économe (4 personnes) consomme de l'ordre de 2036 kWh/m²\n- Pour le secteur tertiaire, consommation estimée à 100 kWh/(m²*an) (source: Bilan énergétque Bruxellois/bureaux)\n- une maison individuelle consomme de l'ordre de 3500 kwh/an\n- Pour d'autres affectations (hopitaux...), veuillez affiner cette consommation projetée en cellulle H14,\n\nIl est nécessaire d'insister sur le fait que, en réalité, le recours à l'énergie photovoltaïque ne se conçoit pas sans une réduction et l'optimisation de la consommation électrique. Ceci implique :\n\n* d'une façon générale, la conception et la construction - ou la rénovation - des bâtiments de façon à ce qu'ils aient des besoins énergétiques limités ;\n* l'utilisation d'appareils peu énergivores ;\n* un fonctionnement rationnel dans le temps.\n\nUne telle démarche a pour conséquence de réduire très sensiblement la consommation moyenne d'un ménage, d'une institution ou d'une entreprise, et donc la taille du système photovoltaïque capable de la couvrir."}]
["_Cmt_PrstTool",null,{"$f":"VLOOKUP(\"CommentPrstTool\",Translations,LANG,FALSE)","v":"Présentation de l’outil :\n\nCet outil est un calculateur Excel. Il permet à un utilisateur de rencontrer les éléments entrant en compte dans le dimensionnement et le bilan financier d’un projet photovoltaïque. Il aide à faire percevoir l’intérêt de cette technique afin de faciliter et démultiplier l’investissement dans la production d’électricité solaire.\n\nCet outil d’aide est destiné aux particuliers, responsables techniques, gestionnaires de bâtiments, investisseurs, architectes, maîtres d’ouvrages, ingénieurs conseils, responsables énergies, facilitateurs ou décideur politique. Plus précisément, l’outil s’adresse à toutes personnes disposant de surfaces pouvant être valorisée par la production d’énergie verte.\n\nCependant, les résultats obtenus ne sont qu'une première approximation. Ils ne donnent qu'une indication quant à la suite ou non du projet, à savoir la commande d'une étude de faisabilité dans les \"Règles de l'art\" à une entreprise ou un bureau d'études compétent, et non la commande de l'équipement !"}]
["_Cmt_Peak",null,{"$f":"VLOOKUP(\"CommentPeak\",Translations,LANG,FALSE)","v":"La puissance crête d'un module ou d'une installation photovoltaïque est la puissance électrique délivrée dans des conditions standard de test (STC) :\n- module présenté perpendiculairement aux rayons du soleil \n- ensoleillement nominal de 1 000 Watt / m² \n- spectre solaire normalisé AM = 1,5 \n- température de cellule de + 25 °C."}]
["_Cmt_Estimat",null,{"$f":"VLOOKUP(\"CommentEstimat\",Translations,LANG,FALSE)","v":"L'estimation de l'energie produite tient compte de la surface, de la technologie, du type de montage, de l'orientation et de l'inclinaison."}]
["_Cmt_FirstYR",null,{"$f":"VLOOKUP(\"Het eerste jaar\",Translations,LANG,FALSE)","v":"La première année"}]
["_Cmt_CoutEst",null,{"$f":"VLOOKUP(\"CommentEstCout\",Translations,LANG,FALSE)","v":"L'estimation du prix à payer tient compte de la surface, de la technologie, du type de montage et de la TVA.\nL'investissement initial pour une installation photovoltaïque comprend les modules photovoltaïques, le ou les convertisseurs DC/AC, les composants électriques de sécurité, les câbles électriques et la pose.\n\nCette estimation ne prend pas en compte les frais de raccordement au réseau électrique.\n\nPlus d'informations : www.sibelga.be"}]
["_Cmt_TypeBld",null,{"$f":"VLOOKUP(\"CommentTypeBatPrime\",Translations,LANG,FALSE)","v":"Le niveau énergétique conditionne l'octroi de la prime.\nCette prime s'élève de 0,25 à 1 euro/Watt-crête en fonction de la catégorie de revenu à laquelle vous appartenez et à condition que le bâtiment soit passif ou basse énergie. \nLa prime est plafonnée à 30 % de l'investissement."}]
{"$rows_left_out":4}
{"sheet":"choix-multiples","index":3,"n_rows":185,"n_cols":33,"rows_kept":185,"cut":false,"hidden":false,"merged":[[139,5,139,12],[38,3,38,6],[35,3,35,9],[97,6,97,12],[132,6,132,8],[92,11,92,13],[90,6,90,7],[121,20,122,25],[8,16,8,23],[13,9,13,11],[30,3,30,5],[13,5,13,7],[26,3,26,5],[24,6,24,7],[17,11,17,12],[19,11,19,12],[1,1,1,23],[84,1,84,10],[6,16,6,18],[24,3,24,5],[15,10,15,12],[28,3,28,5],[6,3,6,5]]}
[]
[]
[]
[null,null,null,null,null,null,null,null,null,null,null,null,null,null,null,null,"Résultats:"]
[]
[null,null,null,null,null,null,null,null,null,null,null,null,null,null,null,null,"Installation technique"]
[null,null,null,null,null,null,null,null,null,null,null,null,null,null,null,null,"Puissance installée:",null,null,null,null,{"$f":"EnergieProduite_kWc_m²!H6","v":0},"kWc"]
[null,null,null,null,null,null,null,null,null,null,null,null,null,null,null,null,"Surface de capteur à installer",null,null,null,null,{"$f":"IF(Tool!#REF!=EnergieProduite_kWc_m²!H6,Tool!E46,Tool!#REF!*1000/(EnergieProduite_kWc_m²!C25*(1+EnergieProduite_kWc_m²!F29*0.01)*EnergieProduite_kWc_m²!F24))","v":{"$error":"#REF!"}},"m²"]
[null,null,null,null,null,null,null,null,null,null,null,null,null,null,null,null,"Ce logiciel ne calcule pas l'impact d'éventuelles ombres sur la production des panneaux.Il est important de vérifier s'il y a, à un ou plusieur moments de la journée, un ou des obstacles entre le soleil et les panneaux solaires. 10% d'ombrage sur le panneau et toute la puissance électrique s'écroule ! "]
[null,null,null,null,null,null,null,null,null,null,null,null,null,null,null,null,"Bilan énergétique"]
{"$rows_left_out":176}
{"sheet":"Calculs surface","index":4,"n_rows":17,"n_cols":4,"rows_kept":17,"cut":false,"hidden":true,"merged":[]}
["Ratio entre la surface de toiture disponible et la surface de capteur installable selon l'inclinaison"]
[null,"Inclinaison",null,"Facteur F"]
[{"$f":"'choix-multiples'!E134","v":"Superimposed on an inclined roof"},null,{"$f":"A3","v":"Superimposed on an inclined roof"},0.8]
[{"$f":"'choix-multiples'!E137","v":"Built-in inclined roof"},null,{"$f":"A4","v":"Built-in inclined roof"},0.8]
[{"$f":"'choix-multiples'!E135","v":"Flat roof"},{"$f":"'choix-multiples'!E185","v":35},{"$f":"A5&\"-\"&B5","v":"Flat roof-35"},0.3]
[{"$f":"A5","v":"Flat roof"},{"$f":"'choix-multiples'!E184","v":25},"Flat roof-25",0.35]
[{"$f":"A6","v":"Flat roof"},{"$f":"'choix-multiples'!E183","v":15},"Flat roof-15",0.43]
[{"$f":"'choix-multiples'!E136","v":"Flat roof back-to-back East-West"},null,{"$f":"A8","v":"Flat roof back-to-back East-West"},0.61]
[]
[]
{"$rows_left_out":8}
{"sheet":"Facteur solaire","index":5,"n_rows":47,"n_cols":18,"rows_kept":47,"cut":false,"hidden":false,"merged":[[5,9,5,16]]}
[null,"Orientation","Inclinaison (°)","Production (kWh/kWc)","Max plein sud ",920]
[{"$f":"B2&\"-\"&C2","v":"Sud-0"},"Sud",0]
[{"$f":"B3&\"-\"&C3","v":"Sud-10"},"Sud",10]
["Sud-15","Sud",15,{"$f":"K27*maxsud35","v":892.4}]
["Sud-25","Sud",25,{"$f":"L27*maxsud35","v":910.8},null,null,null,"Orientation des panneaux : "]
["Sud-35","Sud",35,{"$f":"M27*maxsud35","v":920},null,null,null,null,null,"Inclinaison (°)"]
["Sud-40","Sud",40,null,null,null,null,null,null,{"$f":"I21","v":0},{"$f":"I23","v":5},{"$f":"I24","v":0},{"$f":"I25","v":1},{"$f":"I26","v":2},{"$f":"I27","v":3},{"$f":"I28","v":4},{"$f":"I29","v":5},9]
["Sud-45","Sud",45,null,null,null,null,null,{"$f":"'choix-multiples'!K97","v":0},{"$f":"VLOOKUP($D$49,$D$51:$N$57,2,FALSE)","v":{"$error":"#N/A"}},{"$f":"VLOOKUP($D$49,$D$51:$N$57,3,FALSE)","v":{"$error":"#N/A"}},{"$f":"VLOOKUP($D$49,$D$51:$N$57,4,FALSE)","v":{"$error":"#N/A"}},{"$f":"VLOOKUP($D$49,$D$51:$N$57,5,FALSE)","v":{"$error":"#N/A"}},{"$f":"VLOOKUP($D$49,$D$51:$N$57,6,FALSE)","v":{"$error":"#N/A"}},{"$f":"VLOOKUP($D$49,$D$51:$N$57,7,FALSE)","v":{"$error":"#N/A"}},{"$f":"VLOOKUP($D$49,$D$51:$N$57,8,FALSE)","v":{"$error":"#N/A"}},{"$f":"VLOOKUP($D$49,$D$51:$N$57,9,FALSE)","v":{"$error":"#N/A"}},{"$f":"VLOOKUP($D$49,$D$51:$N$57,10,FALSE)","v":{"$error":"#N/A"}}]
["Sud-50","Sud",50]
["Sud-70","Sud",70,null,null,null,null,"Est",1,0.87,0.88,0.87,0.84,0.82,0.8,0.78,0.69,0.89]
{"$rows_left_out":38}
{"sheet":"Page_calcul","index":6,"n_rows":82,"n_cols":31,"rows_kept":82,"cut":false,"hidden":false,"merged":[[18,28,18,29],[17,23,17,29],[17,11,17,13],[17,14,17,18],[17,20,17,22],[52,1,52,4],[53,1,53,4],[63,10,63,11],[17,7,17,8],[17,9,17,10],[17,5,18,5],[17,6,18,6]]}
[]
[null,null,"Page de calcul de l'amortissement d'une installation solaire photovoltaïque"]
[null,null,null,null,null,null,null,null,"Durée de vie économique",30,"ans"]
[null,null,"Investissement total",null,null,null,{"$f":"IF(Tool!E104<1,Tool!F104,Tool!E104)","v":15245.98},"€","Consommation projetée ",{"$f":"IF(Tool!E24=\"\",Tool!F24,Tool!E24)","v":788000},"kWh/an",null,null,null,null,null,null,null,null,null,"Temps de retour (ans)",{"$f":"AE52","v":5.4010777949809894}]
[null,null,"Montant Primes énergies ou Subsides",null,null,null,{"$f":"Coût_Net!E36*100","v":16.397765181378958},"%","Taux d'imposition",{"$f":"IF(Tool!E116=\"\",Tool!F116,Tool!E116)","v":0},null,null,null,null,null,null,null,null,null,null,"TRI (10 ans)",{"$f":"AB31","v":0.140034742412394}]
[null,null,null,"Prime énergie ou subside possible",null,null,{"$f":"G4*(G5/100)","v":2499.9999999999995},"€","Augmentation prix électricité",{"$f":"IF(Tool!E68=\"\",Tool!F68,Tool!E68)","v":5.8700000000000002E-2},null,null,null,null,null,null,null,null,null,null,"TRI (20 ans)",{"$f":"AB41","v":0.1785735948165561}]
[]
[null,null,null,"Conditions plafonnantes",null,null,{"$f":"IF('choix-multiples'!J106=1,0,Coût_Net!F36)","v":4573.7939999999999},"€"]
[null,null,null,"Primes énergies réelles",null,null,{"$f":"IF(G6<G8,G6,G8)","v":2499.9999999999995},"€","Investissement brut",{"$f":"IF(Tool!E104=\"\",Tool!F104,Tool!E104)","v":15245.98},null,null,null,null,null,null,null,null,null,null,"Coût de remplacement de l'onduleur",{"$f":"0.07*G14","v":1067.2186000000002},"à l'année",15]
[null,null,"Aides régionales entreprises",null,null,null,{"$f":"J12","v":0},"€"]
{"$rows_left_out":73}
{"sheet":"Coût_Net","index":7,"n_rows":82,"n_cols":26,"rows_kept":82,"cut":false,"hidden":false,"merged":[]}
[]
[null,null,"Régions","Types de structures","1. Montant Primes ou Subsides (%)","1' Condition plafonnante calculées (€)","2. Montant Certificats Verts jusqu'à 5 kWc en RW et 20m² en RBC (€/kWh)","2'. Montant Certificats Verts au-delà de 5 kWc en RW où entre 20m² et 60 m² en RBC (€/kWh)","2'' Montant Certificats Verts pour plus de 40m² en RBC (€/kWh)","3. Prix Electricité (€/kWh TVAC)","3'. Prix Electricité en cas de rachat (€/kWh TVAC)","4. Déduction Impôt IPP (%)","4' Conditions Impôts","5. Charge Financière par an en ... ans (K+int) sur le TOTAL de l'investissement","6. Durée de l'amortissement fiscale (année) ","7. Amortissement et économie Isoc par an (21% pendant … ans)","8. Assurance Vol / Dégâts (€/an et par kW)","9, Entretien","Pouvoir public :","Facilitateurs :","Primes :","Certificats verts :","Déductions fiscales :","Primes (€/Wc)","Calcul du Montant de la primes (€)"]
[null,null,null,null,null,{"$f":"IF(Tool!E104<1,Tool!F104,Tool!E104)","v":15245.98},null,null,null,null,null,null,null,null,null,null,null,null,null,null,null,null,null,0.25,{"$f":"X3*1000*Tool!$E$46","v":2500}]
[null,null,"Région Bruxelles Capitale",1,{"$f":"IF(Tool!$E$104<1,Coût_Net!Y3/Tool!$F$104,Coût_Net!Y3/Tool!$E$104)","v":0.16397765181378959},{"$f":"IF($F$3<666666.666666667,$F$3*0.3,200000)","v":4573.7939999999999},{"$f":"Certificats_Verts!$E$13","v":0},{"$f":"Certificats_Verts!$F$13","v":0},{"$f":"Certificats_Verts!$G$13","v":0.16600499999999999},{"$f":"R69","v":0.14560000000000001},0.05,{"$f":"0.135*Page_calcul!J5","v":0},999999999999,0,0,0,18.510000000000002,0.5,"http://www.ibgebim.be","http://www.ibgebim.be/francais/contenu/content.asp?ref=1762","http://www.ibgebim.be","http://www.brugel.be","",0.25,{"$f":"X4*1000*Tool!$E$46","v":2500},"Tertiaire"]
[null,null,null,2,{"$f":"IF(Tool!$E$104<1,Coût_Net!Y4/Tool!$F$104,Coût_Net!Y4/Tool!$E$104)","v":0.16397765181378959},{"$f":"($F$3*0.3)","v":4573.7939999999999},{"$f":"Certificats_Verts!$E$13","v":0},{"$f":"Certificats_Verts!$F$13","v":0},{"$f":"Certificats_Verts!$G$13","v":0.16600499999999999},0.2,0.05,0.4,{"$f":"Tool!G21*3680","v":3680000},0,0,0,18.510000000000002,0.05,"http://www.ibgebim.be","http://www.ibgebim.be/francais/contenu/content.asp?ref=2393","http://www.ibgebim.be","http://www.brugel.be","http://mineco.fgov.be",1,{"$f":"X5*1000*Tool!$E$46","v":10000},"Log coll"]
[null,null,null,3,{"$f":"IF(Tool!$E$104<1,Coût_Net!Y7/Tool!$F$104,Coût_Net!Y7/Tool!$E$104)","v":0.16397765181378959},{"$f":"$F$3*0.3","v":4573.7939999999999},{"$f":"Certificats_Verts!$E$13","v":0},{"$f":"Certificats_Verts!$F$13","v":0},{"$f":"Certificats_Verts!$G$13","v":0.16600499999999999},0.2,0.05,0.4,3680,0,7,0.21,0,null,"http://www.ibgebim.be","http://www.apere.org","http://www.ibgebim.be","http://www.brugel.be","http://mineco.fgov.be",{"$f":" IF('choix-multiples'!H120=1,0.25,IF('choix-multiples'!H120=2,0.5,1))","v":0.25},{"$f":"X6*1000*Tool!$E$46","v":2500},"Maison indiv"]
[null,null,null,4,0,999999999999,{"$f":"Certificats_Verts!$E$13","v":0},{"$f":"Certificats_Verts!$F$13","v":0},{"$f":"Certificats_Verts!$G$13","v":0.16600499999999999},0.2,0.05,0,999999999999,0,7,0.21,0,null,"http://www.ibgebim.be",null,"http://www.ibgebim.be","http://www.brugel.be","http://mineco.fgov.be",{"$f":" IF('choix-multiples'!H120=1,0.25,IF('choix-multiples'!H120=2,0.5,1))","v":0.25},{"$f":"X7*1000*Tool!$E$46","v":2500},"Autres"]
[null,null,null,5,{"$f":"IF(Tool!$E$104<1,Coût_Net!Y3/Tool!$F$104,Coût_Net!Y3/Tool!$E$104)","v":0.16397765181378959},{"$f":"IF($F$3<666666.666666667,$F$3*0.3,200000)","v":4573.7939999999999},{"$f":"Certificats_Verts!$E$13","v":0},{"$f":"Certificats_Verts!$F$13","v":0},{"$f":"Certificats_Verts!$G$13","v":0.16600499999999999},0.2,0.05,4.5886500000000004E-2,999999999999,0,7,0.21,18.510000000000002,null,"http://www.ibgebim.be",null,null,null,null,null,{"$f":"X6*1000*Tool!$E$46","v":2500}]
[null,null,null,6,{"$f":"IF(Tool!$E$104<1,Coût_Net!Y3/Tool!$F$104,Coût_Net!Y3/Tool!$E$104)","v":0.16397765181378959},{"$f":"IF($F$3<666666.666666667,$F$3*0.3,200000)","v":4573.7939999999999},{"$f":"Certificats_Verts!$E$13","v":0},{"$f":"Certificats_Verts!$F$13","v":0},{"$f":"Certificats_Verts!$G$13","v":0.16600499999999999},0.2,0.05,4.5886500000000004E-2,999999999999,0,7,0.21,18.510000000000002,null,"http://www.ibgebim.be",null,"http://www.ibgebim.be","http://www.brugel.be",""]
[]
{"$rows_left_out":73}
{"sheet":"Calcul_CoûtBrut_m²","index":8,"n_rows":170,"n_cols":19,"rows_kept":170,"cut":false,"hidden":true,"merged":[]}
[]
[]
[2,"Type de technologie :",null,"Coût supplémentaire par rapport au prix de base"]
[null,null,{"$f":"'choix-multiples'!G125","v":1},{"$f":"VLOOKUP(C4,C6:D8,2,FALSE)","v":-5},"%"]
[null,null,null,null,null,null,null,"Coût d'entretien annuel"]
[null,"Polycristallin",1,-5,"%",null,null,"puissance installation",{"$f":"_cmt_peak_used","v":10}]
[null,"Monocristallin",2,-5,"%",null,null,"range",{"$f":"VLOOKUP(1,$J11:$L17,2,FALSE)","v":225},{"$f":"VLOOKUP(1,$J11:$L17,3,FALSE)","v":"€/an"}]
[null,"Monocristallin haute-performance",3,0,"%",null,null,"Coût d'entretien annuel",{"$f":"IF(J7=L11,I7,I7*I6)","v":225},{"$f":"L11","v":"€/an"}]
[]
[3,"Type de montage :",null,"Facteur coût lié au type d'installation",null,null,"De","à (non-inclus)"]
{"$rows_left_out":161}
{"sheet":"EnergieProduite_kWc_m²","index":9,"n_rows":66,"n_cols":12,"rows_kept":66,"cut":false,"hidden":true,"merged":[[46,3,46,10],[3,2,3,6]]}
[]
[]
[]
[]
[]
[]
[]
[]
[]
[null,null,"Energie net produite par le générateur photovoltaïque :",null,null,null,null,{"$f":"D18*D19","v":9021},"kWh/an"]
{"$rows_left_out":57}
{"sheet":"Certificats_Verts","index":10,"n_rows":82,"n_cols":19,"rows_kept":82,"cut":false,"hidden":false,"merged":[[38,13,48,22]]}
[]
[]
[null,null,null,null,"Puissance électrique ≤ 5kWc",null,"Toutes tailles",null,null,"Technologie","kWc",null,null,"Paramètres"]
[null,null,"Région Bruxelles Capitale",null,"et personne morale ou pouvoir public",null,null,null,null,{"$f":"'choix-multiples'!G125","v":1},{"$f":"_cmt_peak_used","v":10},null,null,"Coefficient d'émission en CO2 de l'installation PV",{"$f":"'choix-multiples'!G93","v":394.5}]
[null,null,null,null,null,null,null,null,null,null,null,null,null,"Coefficient multiplicateur PV si Pélec > 5kWc",{"$f":"IF(AND(K4<=5,'choix-multiples'!F98=1),1.32,1.32)","v":1.32}]
[null,null,null,"Energie produite par l'installation envisagée (kWh)",{"$f":"IF(AND(K4<=5,'choix-multiples'!F98=1),H6,0)","v":0},null,{"$f":"IF(E6=0,H6,0)","v":8924},{"$f":"_Cmt_Estimat","v":8924},null,null,null,null,null,"Coefficient multiplicateur PV si Pélec < 5kWc",1.65]
[null,null,null,"CV/MWh",{"$f":"O10","v":1.9530000000000001},null,{"$f":"O10","v":1.9530000000000001}]
[null,null,null,"Nombre CV",{"$f":"E6*E7/1000","v":0},null,{"$f":"G6*G7/1000","v":17.428571999999999},{"$f":"SUM(E8:G8)","v":17.428571999999999},null,null,null,null,null,"Plage de puissance",{"$f":"IF(AND(K4>0,K4<=P13),Q13,IF(AND(K4>O14,K4<=P14),Q14,IF(AND(K4>O15,K4<=P15),Q15,IF(AND(K4>O16,K4<=P16),Q16,IF(K4>O17,Q17,\"Error\")))))","v":"]5,36]"}]
[null,null,null,"€ de CV/an pour 10 ans",{"$f":"E8*Tool!$E$91","v":0},null,{"$f":"G8*Tool!E91","v":1481.4286199999999},{"$f":"SUM(E9:G9)","v":1481.4286199999999},null,null,null,null,null,"Coef Multi",{"$f":"_xlfn.IFNA(VLOOKUP(O8,Q12:S17,2,FALSE),0)","v":1.0740000000000001}]
[null,null,null,"€ de CV/an entre 10 et 15 ans",0,null,0,{"$f":"SUM(E10:G10)","v":0},null,null,null,null,null,"Taux octroi",{"$f":"_xlfn.IFNA(VLOOKUP(O8,Q12:S17,3,FALSE),0)","v":1.9530000000000001}]
{"$rows_left_out":73}
{"sheet":"Tableau pour le rapport","index":11,"n_rows":26,"n_cols":7,"rows_kept":26,"cut":false,"hidden":false,"merged":[[25,1,25,3],[17,1,17,5],[18,1,18,3],[19,1,19,5],[20,1,20,3],[24,1,24,5],[16,1,16,3],[1,1,1,9],[6,1,6,5],[7,1,7,2],[8,1,8,2],[9,1,9,2],[10,1,10,2],[11,1,11,2],[12,1,12,2],[13,1,13,5],[14,1,14,3],[15,1,15,3]]}
[]
[null,"PANNEAUX PHOTOVOLTAÏQUES"]
[]
[null,"Faire un copier-coller du tableau provenant du PVcalc"]
[]
[]
[null,"Caractéristiques de l'installation "]
[null,"Surface de panneaux",null,null,{"$f":"Tool!E51","v":47.761194029850749},"m²"]
[null,"Nombre de panneaux",null,null,{"$f":"E8/1.6","v":29.850746268656717},"panneaux"]
[null,"Orientation ",null,null,"Sud",null,"A remplir"]
{"$rows_left_out":17}
{"sheet":"Déductions_fiscales","index":12,"n_rows":82,"n_cols":22,"rows_kept":82,"cut":false,"hidden":true,"merged":[[2,7,6,12],[2,16,6,20]]}
[]
[]
[null,null,"Déductions Totales :",{"$f":"(IF(K21=0,D22,K22))*D7","v":0},"€",null,null,"\"Il est possible de répartir ses travaux sur plusieurs années, au quel cas la réduction d'impôt est accordée pour chaque année fiscale.\" http://mineco.fgov.be/",null,null,null,null,null,null,null,null,"Pour ce qui concerne les habitations occupées depuis au moins 5 ans avant le début des travaux, et si le montant de la réduction d’impôt de 40 % excède les plafonds de 2 830 ou 3 680 euros pour l’année 2011, cet excédent peut être reporté sur les 3 périodes imposables suivantes sans dépasser, par période imposable, le montant limite précité, y compris les nouvelles dépenses de la période."]
[null,null,"Coût de l'installation déductions faites :",{"$f":"IF(K21=0,D21,K21)","v":15245.98},"€"]
[]
[null,null,null,"Code"]
[null,null,{"$f":"H12","v":2},1]
[]
[]
[]
{"$rows_left_out":73}
{"sheet":"Messages","index":13,"n_rows":0,"n_cols":0,"rows_kept":0,"cut":false,"hidden":true,"merged":[]}

{"sheet":"Révision de versions","index":14,"n_rows":44,"n_cols":2,"rows_kept":44,"cut":false,"hidden":false,"merged":[]}
[]
["Version du ","Les onglets en rouges sont ceux ajoutés"]
["2018-10-04","Fonctionnement général et réparations des bugs (Comments, translations, etc)"]
[null,"Systèmes tracker et posés au sol retirés"]
[null,"Panneaux amorphes retirés"]
[null,"Chiffres de consommations estimées modifiées : (kWh/m²/an) selon le secteur d'activité"]
[null,"On ne peut plus que choisir 3 possibilités d'inclinaison : 15° ; 25° ou 35°"]
[null,"Le calcul de la surface de PV est maintenant fonction des inclinaisons encodées (la distance entre rangées pour éviter l'ombre le 21/12 varie selon inclinaison des panneaux)"]
[null,"Modification des facteurs de production selon inclinaison et orientation"]
[null,"Pour la configuration est-ouest, le facteur de production est fixe"]
{"$rows_left_out":34}